Reaction Details
TargetDelta-type opioid receptor
LigandBDBM50204782
Substrate/Competitorn/a
Meas. Tech.ChEMBL_454477 (CHEMBL886503)
Ki 14770±n/a nM
Citation Caldwell, JPMatasi, JJZhang, HFawzi, ATulshian, DB Synthesis and structure-activity relationships of N-substituted spiropiperidines as nociceptin receptor ligands. Bioorg Med Chem Lett17:2281-4 (2007) 
 
Delta-type opioid receptor
Name:Delta-type opioid receptor
Type:G Protein-Coupled Receptor (GPCR)
Mol. Mass.:40382.98
Organism:Homo sapiens (Human)
Description:Competition binding assays were carried out using membrane preparations from transfected HN9.10 cells that constitutively expressed the delta opioid receptor.
Residue:372
BDBM50204782
NameBDBM50204782
Synonyms:8-[(2-chloro-phenyl)-phenyl-methyl]-1-phenyl-1,3,8-triaza-spiro[4.5]decan-4-one | CHEMBL428563
TypeSmall organic molecule
Emp. Form.C26H26ClN3O
Mol. Mass.431.957
SMILESClc1ccccc1C(N1CCC2(CC1)N(CNC2=O)c1ccccc1)c1ccccc1