Reaction Details
TargetDelta-type opioid receptor
LigandBDBM50204780
Substrate/Competitorn/a
Meas. Tech.ChEMBL_454477 (CHEMBL886503)
Ki 73655±n/a nM
Citation Caldwell, JPMatasi, JJZhang, HFawzi, ATulshian, DB Synthesis and structure-activity relationships of N-substituted spiropiperidines as nociceptin receptor ligands. Bioorg Med Chem Lett17:2281-4 (2007) 
 
Delta-type opioid receptor
Name:Delta-type opioid receptor
Type:G Protein-Coupled Receptor (GPCR)
Mol. Mass.:40382.98
Organism:Homo sapiens (Human)
Description:Competition binding assays were carried out using membrane preparations from transfected HN9.10 cells that constitutively expressed the delta opioid receptor.
Residue:372
BDBM50204780
NameBDBM50204780
Synonyms:8-cyclohexylmethyl-1-phenyl-1,3,8-triaza-spiro[4.5]decan-4-one | CHEMBL240001
TypeSmall organic molecule
Emp. Form.C20H29N3O
Mol. Mass.327.4638
SMILESO=C1NCN(c2ccccc2)C11CCN(CC2CCCCC2)CC1