Reaction Details
TargetNociceptin receptor
LigandBDBM50204765
Substrate/Competitorn/a
Meas. Tech.ChEMBL_454476 (CHEMBL886502)
Ki 3.5±n/a nM
Citation Caldwell, JPMatasi, JJZhang, HFawzi, ATulshian, DB Synthesis and structure-activity relationships of N-substituted spiropiperidines as nociceptin receptor ligands. Bioorg Med Chem Lett17:2281-4 (2007) 
 
Nociceptin receptor
Name:Nociceptin receptor
Type:G Protein-Coupled Receptor (GPCR)
Mol. Mass.:40702.87
Organism:Homo sapiens (Human)
Description:P41146
Residue:370
BDBM50204765
NameBDBM50204765
Synonyms:1-phenyl-8-(1-phenyl-ethyl)-1,3,8-triaza-spiro[4.5]decan-4-one | CHEMBL392893
TypeSmall organic molecule
Emp. Form.C21H25N3O
Mol. Mass.335.4427
SMILESCC(N1CCC2(CC1)N(CNC2=O)c1ccccc1)c1ccccc1