Reaction Details
TargetNociceptin receptor
LigandBDBM50204779
Substrate/Competitorn/a
Meas. Tech.ChEMBL_454476 (CHEMBL886502)
Ki 2.6±n/a nM
Citation Caldwell, JPMatasi, JJZhang, HFawzi, ATulshian, DB Synthesis and structure-activity relationships of N-substituted spiropiperidines as nociceptin receptor ligands. Bioorg Med Chem Lett17:2281-4 (2007) 
 
Nociceptin receptor
Name:Nociceptin receptor
Type:G Protein-Coupled Receptor (GPCR)
Mol. Mass.:40702.87
Organism:Homo sapiens (Human)
Description:P41146
Residue:370
BDBM50204779
NameBDBM50204779
Synonyms:8-(8-chloro-1,2,3,4-tetrahydro-naphthalen-1-yl)-1-phenyl-1,3,8-triaza-spiro[4.5]decan-4-one | CHEMBL393781
TypeSmall organic molecule
Emp. Form.C23H26ClN3O
Mol. Mass.395.925
SMILESClc1cccc2CCCC(N3CCC4(CC3)N(CNC4=O)c3ccccc3)c12