Reaction Details
TargetMu-type opioid receptor
LigandBDBM50204774
Substrate/Competitorn/a
Meas. Tech.ChEMBL_454479 (CHEMBL886505)
Ki 2454±n/a nM
Citation Caldwell, JPMatasi, JJZhang, HFawzi, ATulshian, DB Synthesis and structure-activity relationships of N-substituted spiropiperidines as nociceptin receptor ligands. Bioorg Med Chem Lett17:2281-4 (2007) 
 
Mu-type opioid receptor
Name:Mu-type opioid receptor
Type:G Protein-Coupled Receptor (GPCR)
Mol. Mass.:44789.51
Organism:Homo sapiens (Human)
Description:P35372
Residue:400
BDBM50204774
NameBDBM50204774
Synonyms:8-(10,11-dihydro-5H-dibenzo[a,d]cyclohepten-5-yl)-1-phenyl-1,3,8-triaza-spiro[4.5]decan-4-one | CHEMBL240870
TypeSmall organic molecule
Emp. Form.C28H29N3O
Mol. Mass.423.5494
SMILESO=C1NCN(c2ccccc2)C11CCN(CC1)C1c2ccccc2CCc2ccccc12