Reaction Details
TargetMu-type opioid receptor
LigandBDBM50204786
Substrate/Competitorn/a
Meas. Tech.ChEMBL_454479 (CHEMBL886505)
Ki 133±n/a nM
Citation Caldwell, JPMatasi, JJZhang, HFawzi, ATulshian, DB Synthesis and structure-activity relationships of N-substituted spiropiperidines as nociceptin receptor ligands. Bioorg Med Chem Lett17:2281-4 (2007) 
 
Mu-type opioid receptor
Name:Mu-type opioid receptor
Type:G Protein-Coupled Receptor (GPCR)
Mol. Mass.:44789.51
Organism:Homo sapiens (Human)
Description:P35372
Residue:400
BDBM50204786
NameBDBM50204786
Synonyms:1-phenyl-8-thiophen-3-ylmethyl-1,3,8-triaza-spiro[4.5]decan-4-one | CHEMBL240033
TypeSmall organic molecule
Emp. Form.C18H21N3OS
Mol. Mass.327.444
SMILESO=C1NCN(c2ccccc2)C11CCN(Cc2ccsc2)CC1