Reaction Details
TargetMu-type opioid receptor
LigandBDBM50204788
Substrate/Competitorn/a
Meas. Tech.ChEMBL_454479 (CHEMBL886505)
Ki 1616±n/a nM
Citation Caldwell, JPMatasi, JJZhang, HFawzi, ATulshian, DB Synthesis and structure-activity relationships of N-substituted spiropiperidines as nociceptin receptor ligands. Bioorg Med Chem Lett17:2281-4 (2007) 
 
Mu-type opioid receptor
Name:Mu-type opioid receptor
Type:G Protein-Coupled Receptor (GPCR)
Mol. Mass.:44789.51
Organism:Homo sapiens (Human)
Description:P35372
Residue:400
BDBM50204788
NameBDBM50204788
Synonyms:8-[bis-(3-chloro-phenyl)-methyl]-1-phenyl-1,3,8-triaza-spiro[4.5]decan-4-one | CHEMBL239819
TypeSmall organic molecule
Emp. Form.C26H25Cl2N3O
Mol. Mass.466.402
SMILESClc1cccc(c1)C(N1CCC2(CC1)N(CNC2=O)c1ccccc1)c1cccc(Cl)c1