Reaction Details
TargetNociceptin receptor
LigandBDBM50204771
Substrate/Competitorn/a
Meas. Tech.ChEMBL_454476 (CHEMBL886502)
Ki 12±n/a nM
Citation Caldwell, JPMatasi, JJZhang, HFawzi, ATulshian, DB Synthesis and structure-activity relationships of N-substituted spiropiperidines as nociceptin receptor ligands. Bioorg Med Chem Lett17:2281-4 (2007) 
 
Nociceptin receptor
Name:Nociceptin receptor
Type:G Protein-Coupled Receptor (GPCR)
Mol. Mass.:40702.87
Organism:Homo sapiens (Human)
Description:P41146
Residue:370
BDBM50204771
NameBDBM50204771
Synonyms:1-phenyl-8-(phenyl-o-tolyl-methyl)-1,3,8-triaza-spiro[4.5]decan-4-one | CHEMBL241079
TypeSmall organic molecule
Emp. Form.C27H29N3O
Mol. Mass.411.5387
SMILESCc1ccccc1C(N1CCC2(CC1)N(CNC2=O)c1ccccc1)c1ccccc1