Reaction Details
TargetKappa-type opioid receptor
LigandBDBM50204787
Substrate/Competitorn/a
Meas. Tech.ChEMBL_454478 (CHEMBL886504)
Ki 61±n/a nM
Citation Caldwell, JPMatasi, JJZhang, HFawzi, ATulshian, DB Synthesis and structure-activity relationships of N-substituted spiropiperidines as nociceptin receptor ligands. Bioorg Med Chem Lett17:2281-4 (2007) 
 
Kappa-type opioid receptor
Name:Kappa-type opioid receptor
Type:G Protein-Coupled Receptor (GPCR)
Mol. Mass.:42648.76
Organism:Homo sapiens (Human)
Description:P41145
Residue:380
BDBM50204787
NameBDBM50204787
Synonyms:1-phenyl-8-(1-phenyl-propyl)-1,3,8-triaza-spiro[4.5]decan-4-one | CHEMBL240216
TypeSmall organic molecule
Emp. Form.C22H27N3O
Mol. Mass.349.4693
SMILESCCC(N1CCC2(CC1)N(CNC2=O)c1ccccc1)c1ccccc1