Reaction Details
TargetMu-type opioid receptor
LigandBDBM50204769
Substrate/Competitorn/a
Meas. Tech.ChEMBL_454479 (CHEMBL886505)
Ki 72±n/a nM
Citation Caldwell, JPMatasi, JJZhang, HFawzi, ATulshian, DB Synthesis and structure-activity relationships of N-substituted spiropiperidines as nociceptin receptor ligands. Bioorg Med Chem Lett17:2281-4 (2007) 
 
Mu-type opioid receptor
Name:Mu-type opioid receptor
Type:G Protein-Coupled Receptor (GPCR)
Mol. Mass.:44789.51
Organism:Homo sapiens (Human)
Description:P35372
Residue:400
BDBM50204769
NameBDBM50204769
Synonyms:8-(5-fluoro-1,2,3,4-tetrahydro-naphthalen-1-yl)-1-phenyl-1,3,8-triaza-spiro[4.5]decan-4-one | CHEMBL240005
TypeSmall organic molecule
Emp. Form.C23H26FN3O
Mol. Mass.379.4704
SMILESFc1cccc2C(CCCc12)N1CCC2(CC1)N(CNC2=O)c1ccccc1