Reaction Details
TargetMu-type opioid receptor
LigandBDBM50204783
Substrate/Competitorn/a
Meas. Tech.ChEMBL_454479 (CHEMBL886505)
Ki 22±n/a nM
Citation Caldwell, JPMatasi, JJZhang, HFawzi, ATulshian, DB Synthesis and structure-activity relationships of N-substituted spiropiperidines as nociceptin receptor ligands. Bioorg Med Chem Lett17:2281-4 (2007) 
 
Mu-type opioid receptor
Name:Mu-type opioid receptor
Type:G Protein-Coupled Receptor (GPCR)
Mol. Mass.:44789.51
Organism:Homo sapiens (Human)
Description:P35372
Residue:400
BDBM50204783
NameBDBM50204783
Synonyms:1-phenyl-8-(1-phenyl-pentyl)-1,3,8-triaza-spiro[4.5]decan-4-one | CHEMBL391082
TypeSmall organic molecule
Emp. Form.C24H31N3O
Mol. Mass.377.5224
SMILESCCCCC(N1CCC2(CC1)N(CNC2=O)c1ccccc1)c1ccccc1