Reaction Details
TargetEstrogen receptor
LigandBDBM50204806
Substrate/Competitorn/a
Meas. Tech.ChEMBL_454488 (CHEMBL886514)
IC50 4±n/a nM
Citation Dykstra, KDGuo, LBirzin, ETChan, WYang, YTHayes, ECDaSilva, CAPai, LYMosley, RTKraker, BFitzgerald, PMDiNinno, FRohrer, SPSchaeffer, JMHammond, ML Estrogen receptor ligands. Part 16: 2-Aryl indoles as highly subtype selective ligands for ERalpha. Bioorg Med Chem Lett17:2322-8 (2007) 
 
Estrogen receptor
Name:Estrogen receptor
Type:Protein
Mol. Mass.:66230.44
Organism:Homo sapiens (Human)
Description:P03372
Residue:595
BDBM50204806
NameBDBM50204806
Synonyms:CHEMBL437190 | N-((S)-1-(1-((S)-4-(2-((S)-3-methylpyrrolidin-1-yl)ethoxy)benzyl)-5-hydroxy-3-methyl-1H-indol-2-yl)ethyl)-2-(2-phenyl-1H-indol-3-yl)acetamide
TypeSmall organic molecule
Emp. Form.C41H44N4O3
Mol. Mass.640.8131
SMILESC[C@H](NC(=O)Cc1c([nH]c2ccccc12)-c1ccccc1)c1c(C)c2cc(O)ccc2n1Cc1ccc(OCCN2CC[C@H](C)C2)cc1