Reaction Details
TargetEstrogen receptor
LigandBDBM50204818
Substrate/Competitorn/a
Meas. Tech.ChEMBL_454488 (CHEMBL886514)
IC50 23±n/a nM
Citation Dykstra, KDGuo, LBirzin, ETChan, WYang, YTHayes, ECDaSilva, CAPai, LYMosley, RTKraker, BFitzgerald, PMDiNinno, FRohrer, SPSchaeffer, JMHammond, ML Estrogen receptor ligands. Part 16: 2-Aryl indoles as highly subtype selective ligands for ERalpha. Bioorg Med Chem Lett17:2322-8 (2007) 
 
Estrogen receptor
Name:Estrogen receptor
Type:Protein
Mol. Mass.:66230.44
Organism:Homo sapiens (Human)
Description:P03372
Residue:595
BDBM50204818
NameBDBM50204818
Synonyms:(R)-N-(4-(4-hydroxyphenyl)butan-2-yl)-2-(2-phenyl-7-(4-(piperidin-1-yl)butoxy)-1H-indol-3-yl)acetamide | CHEMBL238960
TypeSmall organic molecule
Emp. Form.C35H43N3O3
Mol. Mass.553.7342
SMILESC[C@H](CCc1ccc(O)cc1)NC(=O)Cc1c([nH]c2c(OCCCCN3CCCCC3)cccc12)-c1ccccc1