Reaction Details
TargetQuinone oxidoreductase
LigandBDBM50204915
Substrate/Competitorn/a
Meas. Tech.ChEMBL_428131 (CHEMBL915768)
IC50>50000±n/a nM
Citation Krick, AKehraus, SGerhäuser, CKlimo, KNieger, MMaier, AFiebig, HHAtodiresei, IRaabe, GFleischhauer, JKönig, GM Potential cancer chemopreventive in vitro activities of monomeric xanthone derivatives from the marine algicolous fungus Monodictys putredinis. J Nat Prod70:353-60 (2007) 
 
Quinone oxidoreductase
Name:Quinone oxidoreductase
Type:PROTEIN
Mol. Mass.:35275.21
Organism:Mus musculus
Description:ChEMBL_428131
Residue:331
BDBM50204915
NameBDBM50204915
Synonyms:(1S,3S,4S,4aS,9aS)-1,4,8-trihydroxy-3,4a-dimethyl-1,2,3,4,4a,9a-hexahydro-9H-xanthen-9-one | CHEMBL223073
TypeSmall organic molecule
Emp. Form.C15H18O5
Mol. Mass.278.3004
SMILESC[C@H]1C[C@H](O)[C@@H]2C(=O)c3c(O)cccc3O[C@]2(C)[C@H]1O