Reaction Details
TargetCannabinoid receptor 2
LigandBDBM50205167
Substrate/Competitorn/a
Meas. Tech.ChEMBL_438314 (CHEMBL887422)
IC50 394.4±n/a nM
Citation Armstrong, HEGalka, ALin, LSLanza, TJJewell, JPShah, SKGuthikonda, RTruong, QChang, LLQuaker, GColandrea, VJTong, XWang, JXu, SFong, TMShen, CPLao, JChen, JShearman, LPStribling, DSRosko, KStrack, AHa, SVan der Ploeg, LGoulet, MTHagmann, WK Substituted acyclic sulfonamides as human cannabinoid-1 receptor inverse agonists. Bioorg Med Chem Lett17:2184-7 (2007) 
 
Cannabinoid receptor 2
Name:Cannabinoid receptor 2
Type:G Protein-Coupled Receptor (GPCR)
Mol. Mass.:39690.94
Organism:Homo sapiens (Human)
Description:P34972
Residue:360
BDBM50205167
NameBDBM50205167
Synonyms:CHEMBL230717 | biphenyl-3-sulfonic acid [(1S,2S)-3-(4-chloro-phenyl)-2-(3-cyano-phenyl)-1-methyl-propyl]-amide
TypeSmall organic molecule
Emp. Form.C29H25ClN2O2S
Mol. Mass.501.039
SMILESC[C@H](NS(=O)(=O)c1cccc(c1)-c1ccccc1)[C@@H](Cc1ccc(Cl)cc1)c1cccc(c1)C#N