Reaction Details
TargetCannabinoid receptor 2
LigandBDBM50205183
Substrate/Competitorn/a
Meas. Tech.ChEMBL_438314 (CHEMBL887422)
IC50 668.2±n/a nM
Citation Armstrong, HEGalka, ALin, LSLanza, TJJewell, JPShah, SKGuthikonda, RTruong, QChang, LLQuaker, GColandrea, VJTong, XWang, JXu, SFong, TMShen, CPLao, JChen, JShearman, LPStribling, DSRosko, KStrack, AHa, SVan der Ploeg, LGoulet, MTHagmann, WK Substituted acyclic sulfonamides as human cannabinoid-1 receptor inverse agonists. Bioorg Med Chem Lett17:2184-7 (2007) 
 
Cannabinoid receptor 2
Name:Cannabinoid receptor 2
Type:G Protein-Coupled Receptor (GPCR)
Mol. Mass.:39690.94
Organism:Homo sapiens (Human)
Description:P34972
Residue:360
BDBM50205183
NameBDBM50205183
Synonyms:2-chloro-N-((2S,3S)-4-(4-chlorophenyl)-3-(3-cyanophenyl)butan-2-yl)benzenesulfonamide | CHEMBL230713
TypeSmall organic molecule
Emp. Form.C23H20Cl2N2O2S
Mol. Mass.459.388
SMILESC[C@H](NS(=O)(=O)c1ccccc1Cl)[C@@H](Cc1ccc(Cl)cc1)c1cccc(c1)C#N