Reaction Details
TargetCannabinoid receptor 1
LigandBDBM21278
Substrate/Competitorn/a
Meas. Tech.ChEMBL_438315 (CHEMBL887423)
IC50 6.1±n/a nM
Citation Armstrong, HEGalka, ALin, LSLanza, TJJewell, JPShah, SKGuthikonda, RTruong, QChang, LLQuaker, GColandrea, VJTong, XWang, JXu, SFong, TMShen, CPLao, JChen, JShearman, LPStribling, DSRosko, KStrack, AHa, SVan der Ploeg, LGoulet, MTHagmann, WK Substituted acyclic sulfonamides as human cannabinoid-1 receptor inverse agonists. Bioorg Med Chem Lett17:2184-7 (2007) 
 
Cannabinoid receptor 1
Name:Cannabinoid receptor 1
Type:G Protein-Coupled Receptor (GPCR)
Mol. Mass.:52868.96
Organism:Homo sapiens (Human)
Description:P21554
Residue:472
BDBM21278
NameBDBM21278
Synonyms:5-(4-chlorophenyl)-1-(2,4-dichlorophenyl)-4-methyl-N-(piperidin-1-yl)-1H-pyrazole-3-carboxamide CHEMBL111 RIMONABANT HYDROCHLORIDE SR 141716A SR141716A [3H]SR141716A
TypeSmall organic molecule
Emp. Form.C22H21Cl3N4O
Mol. Mass.463.787
SMILESCc1c(nn(c1-c1ccc(Cl)cc1)-c1ccc(Cl)cc1Cl)C(=O)NN1CCCCC1