Reaction Details
TargetMelanocortin receptor 3
LigandBDBM50205744
Substrate/Competitorn/a
Meas. Tech.ChEMBL_442412 (CHEMBL892574)
IC50 43±n/a nM
Citation Ballet, SMayorov, AVCai, MTymecka, DChandler, KBPalmer, ESRompaey, KVMisicka, ATourwé, DHruby, VJ Novel selective human melanocortin-3 receptor ligands: use of the 4-amino-1,2,4,5-tetrahydro-2-benzazepin-3-one (Aba) scaffold. Bioorg Med Chem Lett17:2492-8 (2007) 
 
Melanocortin receptor 3
Name:Melanocortin receptor 3
Type:Enzyme
Mol. Mass.:36044.86
Organism:Homo sapiens (Human)
Description:P41968
Residue:323
BDBM50205744
NameBDBM50205744
Synonyms:(2R,5S,8S,11S,19S)-19-[(2S)-2-aminohexanamido]-5-(3-carbamimidamidopropyl)-8-(1H-indol-3-ylmethyl)-2-(naphthalen-2-ylmethyl)-3,6,9,17,20,31-hexaoxo-1,4,7,10,16,21-hexaazatricyclo[20.8.1.0^{24,29}]hentriaconta-24(29),25,27-triene-11-carboxamide | CHEMBL391704
TypeSmall organic molecule
Emp. Form.C56H71N13O8
Mol. Mass.1054.2452
SMILESCCCC[C@H](N)C(=O)N[C@H]1CC(=O)NCCCC[C@H](NC(=O)[C@H](Cc2c[nH]c3ccccc23)NC(=O)[C@H](CCCN=C(N)N)NC(=O)[C@@H](Cc2ccc3ccccc3c2)N2Cc3ccccc3CC(NC1=O)C2=O)C(N)=O