Reaction Details
TargetC-C chemokine receptor type 5
LigandBDBM50205773
Substrate/Competitorn/a
Meas. Tech.ChEMBL_447183 (CHEMBL897483)
IC50 1100±n/a nM
Citation Lu, SFChen, BDavey, DDunning, LJaroch, SMay, KOnuffer, JPhillips, GSubramanyam, BTseng, JLWei, RGWei, MYe, B CCR5 receptor antagonists: discovery and SAR of novel 4-hydroxypiperidine derivatives. Bioorg Med Chem Lett17:1883-7 (2007) 
 
C-C chemokine receptor type 5
Name:C-C chemokine receptor type 5
Type:Enzyme
Mol. Mass.:40540.21
Organism:Homo sapiens (Human)
Description:P51681
Residue:352
BDBM50205773
NameBDBM50205773
Synonyms:CHEMBL233385 | N-(2-(4-chlorobenzyloxy)-5-bromobenzyl)ethanamine
TypeSmall organic molecule
Emp. Form.C16H17BrClNO
Mol. Mass.354.669
SMILESCCNCc1cc(Br)ccc1OCc1ccc(Cl)cc1