Reaction Details
TargetMitogen-activated protein kinase 10
LigandBDBM50206423
Substrate/Competitorn/a
Meas. Tech.ChEMBL_428524 (CHEMBL919881)
IC50 3500±n/a nM
Citation Peifer, CKinkel, KAbadleh, MSchollmeyer, DLaufer, S From five- to six-membered rings: 3,4-diarylquinolinone as lead for novel p38MAP kinase inhibitors. J Med Chem50:1213-21 (2007) 
 
Mitogen-activated protein kinase 10
Name:Mitogen-activated protein kinase 10
Type:Enzyme
Mol. Mass.:52586.89
Organism:Homo sapiens (Human)
Description:n/a
Residue:464
BDBM50206423
NameBDBM50206423
Synonyms:4-(5-(4-fluorophenyl)-3-isopropylisoxazol-4-yl)pyridine 5-(4-fluorophenyl)-3-isopropyl-4-(pyridin-4-yl)isoxazole | CHEMBL375428
TypeSmall organic molecule
Emp. Form.C17H15FN2O
Mol. Mass.282.3122
SMILESCC(C)c1noc(c1-c1ccncc1)-c1ccc(F)cc1