Reaction Details
TargetDelta-type opioid receptor
LigandBDBM50206658
Substrate/Competitorn/a
Meas. Tech.ChEMBL_438448 (CHEMBL887548)
Ki 50±n/a nM
Citation Lee, YSNyberg, JMoye, SAgnes, RSDavis, PMa, SWLai, JPorreca, FVardanyan, RHruby, VJ Understanding the structural requirements of 4-anilidopiperidine analogues for biological activities at mu and delta opioid receptors. Bioorg Med Chem Lett17:2161-5 (2007) 
 
Delta-type opioid receptor
Name:Delta-type opioid receptor
Type:G Protein-Coupled Receptor (GPCR)
Mol. Mass.:40382.98
Organism:Homo sapiens (Human)
Description:Competition binding assays were carried out using membrane preparations from transfected HN9.10 cells that constitutively expressed the delta opioid receptor.
Residue:372
BDBM50206658
NameBDBM50206658
Synonyms:(S)-N-(1-(2-amino-3-(4-hydroxy-2,6-dimethylphenyl)propanoyl)piperidin-4-yl)-N-phenylpropionamide | CHEMBL231253
TypeSmall organic molecule
Emp. Form.C25H33N3O3
Mol. Mass.423.5478
SMILESCCC(=O)N(C1CCN(CC1)C(=O)[C@@H](N)Cc1c(C)cc(O)cc1C)c1ccccc1