Reaction Details
TargetMu-type opioid receptor
LigandBDBM50206654
Substrate/Competitorn/a
Meas. Tech.ChEMBL_438449 (CHEMBL887549)
Ki 6400±n/a nM
Citation Lee, YSNyberg, JMoye, SAgnes, RSDavis, PMa, SWLai, JPorreca, FVardanyan, RHruby, VJ Understanding the structural requirements of 4-anilidopiperidine analogues for biological activities at mu and delta opioid receptors. Bioorg Med Chem Lett17:2161-5 (2007) 
 
Mu-type opioid receptor
Name:Mu-type opioid receptor
Type:G Protein-Coupled Receptor (GPCR)
Mol. Mass.:44503.11
Organism:Rattus norvegicus (rat)
Description:Competition binding assays were carried out using membrane preparations from transfected HN9.10 cells that constitutively expressed the mu opioid receptor.
Residue:398
BDBM50206654
NameBDBM50206654
Synonyms:(S)-N-(1-(2-amino-2-phenylacetyl)piperidin-4-yl)-N-phenylpropionamide | CHEMBL389813
TypeSmall organic molecule
Emp. Form.C22H27N3O2
Mol. Mass.365.4687
SMILESCCC(=O)N(C1CCN(CC1)C(=O)[C@@H](N)c1ccccc1)c1ccccc1