Reaction Details
TargetPhospholipase A2, major isoenzyme
LigandBDBM50206917
Substrate/Competitorn/a
Meas. Tech.ChEMBL_428850 (CHEMBL917126)
IC50 39000±n/a nM
Citation Touaibia, MDjimdé, ACao, FBoilard, EBezzine, SLambeau, GRedeuilh, CLamouri, AMassicot, FChau, FDong, CZHeymans, F Inhibition of secreted phospholipase A2. 4-glycerol derivatives of 4,5-dihydro-3-(4-tetradecyloxybenzyl)-1,2,4-4H-oxadiazol-5-one with broad activities. J Med Chem50:1618-26 (2007) 
 
Phospholipase A2, major isoenzyme
Name:Phospholipase A2, major isoenzyme
Type:Hydrolase; monomer or homodimer
Mol. Mass.:16279.83
Organism:Sus scrofa (pig)
Description:Purchased from Sigma.
Residue:146
BDBM50206917
NameBDBM50206917
Synonyms:(+/-)-3-O-[4-(4,5-dihydro-5-oxo-1,2,4-4H-oxadiazol-3-yl)phenyl]-1-O-(3-methoxybenzyl)-2-O-tetradecylglycerol | CHEMBL222738
TypeSmall organic molecule
Emp. Form.C33H48N2O6
Mol. Mass.568.744
(COCc1cccc(OC)c1)COc1ccc(cc1)-c1nc(=O)o[nH]1