Reaction Details
TargetPhospholipase A2, membrane associated
LigandBDBM50055371
Substrate/Competitorn/a
Meas. Tech.ChEMBL_428854 (CHEMBL917130)
IC50 180±n/a nM
Citation Touaibia, MDjimdé, ACao, FBoilard, EBezzine, SLambeau, GRedeuilh, CLamouri, AMassicot, FChau, FDong, CZHeymans, F Inhibition of secreted phospholipase A2. 4-glycerol derivatives of 4,5-dihydro-3-(4-tetradecyloxybenzyl)-1,2,4-4H-oxadiazol-5-one with broad activities. J Med Chem50:1618-26 (2007) 
 
Phospholipase A2, membrane associated
Name:Phospholipase A2, membrane associated
Type:Hydrolase
Mol. Mass.:16101.20
Organism:Homo sapiens (Human)
Description:The human nps PLA2 was cloned, and expressed in E. coli. There was a refolding process in the purification.
Residue:144
BDBM50055371
NameBDBM50055371
Synonyms:(3-aminooxalyl-1-biphenyl-2-ylmethyl-2-methyl-1H-indol-4-yloxy)-acetic acid | CHEMBL357979
TypeSmall organic molecule
Emp. Form.C26H22N2O5
Mol. Mass.442.4633
SMILESCc1c(C(=O)C(N)=O)c2c(OCC(O)=O)cccc2n1Cc1ccccc1-c1ccccc1