Reaction Details
TargetPhospholipase A2, major isoenzyme
LigandBDBM50206904
Substrate/Competitorn/a
Meas. Tech.ChEMBL_428850 (CHEMBL917126)
IC50>25000±n/a nM
Citation Touaibia, MDjimdé, ACao, FBoilard, EBezzine, SLambeau, GRedeuilh, CLamouri, AMassicot, FChau, FDong, CZHeymans, F Inhibition of secreted phospholipase A2. 4-glycerol derivatives of 4,5-dihydro-3-(4-tetradecyloxybenzyl)-1,2,4-4H-oxadiazol-5-one with broad activities. J Med Chem50:1618-26 (2007) 
 
Phospholipase A2, major isoenzyme
Name:Phospholipase A2, major isoenzyme
Type:Hydrolase; monomer or homodimer
Mol. Mass.:16279.83
Organism:Sus scrofa (pig)
Description:Purchased from Sigma.
Residue:146
BDBM50206904
NameBDBM50206904
Synonyms:(+/-)-1-O-benzyl-3-O-[4-(4,5-dihydro-5-oxo-1,2,4-4H-oxadiazol-3-yl)phenyl]-2-Otetradecylglycerol | CHEMBL223233
TypeSmall organic molecule
Emp. Form.C32H46N2O5
Mol. Mass.538.718
(COCc1ccccc1)COc1ccc(cc1)-c1nc(=O)o[nH]1