Reaction Details
TargetGroup 10 secretory phospholipase A2
LigandBDBM50055371
Substrate/Competitorn/a
Meas. Tech.ChEMBL_428856 (CHEMBL917132)
IC50 4570±n/a nM
Citation Touaibia, MDjimdé, ACao, FBoilard, EBezzine, SLambeau, GRedeuilh, CLamouri, AMassicot, FChau, FDong, CZHeymans, F Inhibition of secreted phospholipase A2. 4-glycerol derivatives of 4,5-dihydro-3-(4-tetradecyloxybenzyl)-1,2,4-4H-oxadiazol-5-one with broad activities. J Med Chem50:1618-26 (2007) 
 
Group 10 secretory phospholipase A2
Name:Group 10 secretory phospholipase A2
Type:PROTEIN
Mol. Mass.:18153.11
Organism:Homo sapiens (Human)
Description:ChEMBL_1442449
Residue:165
BDBM50055371
NameBDBM50055371
Synonyms:(3-aminooxalyl-1-biphenyl-2-ylmethyl-2-methyl-1H-indol-4-yloxy)-acetic acid | CHEMBL357979
TypeSmall organic molecule
Emp. Form.C26H22N2O5
Mol. Mass.442.4633
SMILESCc1c(C(=O)C(N)=O)c2c(OCC(O)=O)cccc2n1Cc1ccccc1-c1ccccc1