Reaction Details
Target11-beta-hydroxysteroid dehydrogenase 1
LigandBDBM50207795
Substrate/Competitorn/a
Meas. Tech.ChEMBL_454897 (CHEMBL886926)
IC50 481±n/a nM
Citation Webster, SPWard, PBinnie, MCraigie, EMcConnell, KMSooy, KVinter, ASeckl, JRWalker, BR Discovery and biological evaluation of adamantyl amide 11beta-HSD1 inhibitors. Bioorg Med Chem Lett17:2838-43 (2007) 
 
11-beta-hydroxysteroid dehydrogenase 1
Name:11-beta-hydroxysteroid dehydrogenase 1
Type:Enzyme
Mol. Mass.:32369.70
Organism:Mus musculus (mouse)
Description:P50172
Residue:292
BDBM50207795
NameBDBM50207795
Synonyms:CHEMBL246952 | adamantan-1-yl-(3,4-dihydro-2H-quinolin-1-yl)-methanone
TypeSmall organic molecule
Emp. Form.C20H25NO
Mol. Mass.295.4186
SMILESO=C(N1CCCc2ccccc12)C12CC3CC(CC(C3)C1)C2