Reaction Details
TargetAngiopoietin-1 receptor
LigandBDBM50207862
Substrate/Competitorn/a
Meas. Tech.ChEMBL_455047 (CHEMBL887076)
IC50 4±n/a nM
Citation Hodous, BLGeuns-Meyer, SDHughes, PEAlbrecht, BKBellon, SCaenepeel, SCee, VJChaffee, SCEmery, MFretland, JGallant, PGu, YJohnson, REKim, JLLong, AMMorrison, MOlivieri, PRPatel, VFPolverino, ARose, PWang, LZhao, H Synthesis, structural analysis, and SAR studies of triazine derivatives as potent, selective Tie-2 inhibitors. Bioorg Med Chem Lett17:2886-9 (2007) 
 
Angiopoietin-1 receptor
Name:Angiopoietin-1 receptor
Type:Enzyme
Mol. Mass.:125835.70
Organism:Homo sapiens (Human)
Description:Q02763
Residue:1124
BDBM50207862
NameBDBM50207862
Synonyms:3-isopropyl-N-(3-(3-(2-(methylamino)pyridin-4-yl)pyridin-2-yloxy)phenyl)benzamide | CHEMBL246150
TypeSmall organic molecule
Emp. Form.C27H26N4O2
Mol. Mass.438.5209
SMILESCNc1cc(ccn1)-c1cccnc1Oc1cccc(NC(=O)c2cccc(c2)C(C)C)c1