Reaction Details
TargetMuscarinic acetylcholine receptor M2
LigandBDBM50207991
Substrate/Competitorn/a
Meas. Tech.ChEMBL_429169 (CHEMBL914425)
Ki 302±n/a nM
Citation Peretto, IForlani, RFossati, CGiardina, GAGiardini, AGuala, MLa Porta, EPetrillo, PRadaelli, SRadice, LRaveglia, LFSantoro, EScudellaro, RScarpitta, FBigogno, CMisiano, PDondio, GMRizzi, AArmani, EAmari, GCivelli, MVilletti, GPatacchini, RBergamaschi, MDelcanale, MSalcedo, CFernández, AGImbimbo, BP Discovery of diaryl imidazolidin-2-one derivatives, a novel class of muscarinic M3 selective antagonists (Part 1). J Med Chem50:1571-83 (2007) 
 
Muscarinic acetylcholine receptor M2
Name:Muscarinic acetylcholine receptor M2
Type:GPCR
Mol. Mass.:51730.61
Organism:Homo sapiens (Human)
Description:P08172
Residue:466
BDBM50207991
NameBDBM50207991
Synonyms:3-(1-(3-pyridylmethyl)-piperidin-4-yl)-5,5-diphenyl-imidazolidin-2-one | CHEMBL221660
TypeSmall organic molecule
Emp. Form.C26H28N4O
Mol. Mass.412.5267
SMILESO=C1NC(CN1C1CCN(Cc2cccnc2)CC1)(c1ccccc1)c1ccccc1