Reaction Details
TargetMuscarinic acetylcholine receptor M3
LigandBDBM50208008
Substrate/Competitorn/a
Meas. Tech.ChEMBL_429171 (CHEMBL914427)
Ki 7.6±n/a nM
Citation Peretto, IForlani, RFossati, CGiardina, GAGiardini, AGuala, MLa Porta, EPetrillo, PRadaelli, SRadice, LRaveglia, LFSantoro, EScudellaro, RScarpitta, FBigogno, CMisiano, PDondio, GMRizzi, AArmani, EAmari, GCivelli, MVilletti, GPatacchini, RBergamaschi, MDelcanale, MSalcedo, CFernández, AGImbimbo, BP Discovery of diaryl imidazolidin-2-one derivatives, a novel class of muscarinic M3 selective antagonists (Part 1). J Med Chem50:1571-83 (2007) 
 
Muscarinic acetylcholine receptor M3
Name:Muscarinic acetylcholine receptor M3
Type:Enzyme
Mol. Mass.:66151.03
Organism:Homo sapiens (Human)
Description:P20309
Residue:590
BDBM50208008
NameBDBM50208008
Synonyms:3-(1-(3-hydroxybenzyl)-piperidin-4-yl)-5,5-diphenyl-imidazolidin-2-one | CHEMBL222804
TypeSmall organic molecule
Emp. Form.C27H29N3O2
Mol. Mass.427.5381
SMILESOc1cccc(CN2CCC(CC2)N2CC(NC2=O)(c2ccccc2)c2ccccc2)c1