Reaction Details
TargetMuscarinic acetylcholine receptor M3
LigandBDBM50208031
Substrate/Competitorn/a
Meas. Tech.ChEMBL_429188 (CHEMBL913822)
Ki 356±n/a nM
Citation Peretto, IFossati, CGiardina, GAGiardini, AGuala, MLa Porta, EPetrillo, PRadaelli, SRadice, LRaveglia, LFSantoro, EScudellaro, RScarpitta, FCerri, AMenegon, SDondio, GMRizzi, AArmani, EAmari, GCivelli, MVilletti, GPatacchini, RBergamaschi, MBassani, FDelcanale, MImbimbo, BP Discovery of diaryl imidazolidin-2-one derivatives, a novel class of muscarinic M3 selective antagonists (Part 2). J Med Chem50:1693-7 (2007) 
 
Muscarinic acetylcholine receptor M3
Name:Muscarinic acetylcholine receptor M3
Type:Enzyme
Mol. Mass.:66151.03
Organism:Homo sapiens (Human)
Description:P20309
Residue:590
BDBM50208031
NameBDBM50208031
Synonyms:1-methoxyethyl-3-(2-oxo-4,4-diphenyl-imidazolidin-1-yl)-1-(2-phenoxy-ethyl)-pyrrolidinium | CHEMBL222917
TypeSmall organic molecule
Emp. Form.C30H36N3O3
Mol. Mass.486.6246
SMILESCOCC[N+]1(CCOc2ccccc2)CCC(C1)N1CC(NC1=O)(c1ccccc1)c1ccccc1