Reaction Details
TargetMuscarinic acetylcholine receptor M2
LigandBDBM50208041
Substrate/Competitorn/a
Meas. Tech.ChEMBL_429186 (CHEMBL913820)
Ki 268±n/a nM
Citation Peretto, IFossati, CGiardina, GAGiardini, AGuala, MLa Porta, EPetrillo, PRadaelli, SRadice, LRaveglia, LFSantoro, EScudellaro, RScarpitta, FCerri, AMenegon, SDondio, GMRizzi, AArmani, EAmari, GCivelli, MVilletti, GPatacchini, RBergamaschi, MBassani, FDelcanale, MImbimbo, BP Discovery of diaryl imidazolidin-2-one derivatives, a novel class of muscarinic M3 selective antagonists (Part 2). J Med Chem50:1693-7 (2007) 
 
Muscarinic acetylcholine receptor M2
Name:Muscarinic acetylcholine receptor M2
Type:GPCR
Mol. Mass.:51730.61
Organism:Homo sapiens (Human)
Description:P08172
Residue:466
BDBM50208041
NameBDBM50208041
Synonyms:1-methyl-3-(R)-3-[4,4-bis-(4-fluoro-phenyl)-2-oxo-imidazolidin-1-yl]-1-(2-oxo-2-pyridin-2-ylethyl)-pyrrolidinium | CHEMBL222054
TypeSmall organic molecule
Emp. Form.C27H27F2N4O2
Mol. Mass.477.5251
SMILESC[N+]1(CC(=O)c2ccccn2)CC[C@H](C1)N1CC(NC1=O)(c1ccc(F)cc1)c1ccc(F)cc1