Reaction Details
TargetCholecystokinin receptor type A
LigandBDBM50208419
Substrate/Competitorn/a
Meas. Tech.ChEMBL_443246 (CHEMBL893496)
IC50 665±n/a nM
Citation Tiwari, AKMishra, AKBajpai, AMishra, PSingh, SSinha, DSingh, VK Synthesis and evaluation of novel benzimidazole derivative [Bz-Im] and its radio/biological studies. Bioorg Med Chem Lett17:2749-55 (2007) 
 
Cholecystokinin receptor type A
Name:Cholecystokinin receptor type A
Type:Enzyme Catalytic Domain
Mol. Mass.:49676.37
Organism:RAT
Description:Cholecystokinin central 0 RAT::P30551
Residue:444
BDBM50208419
NameBDBM50208419
Synonyms:2-{2-hydroxy-5-[(E)-2-(4-hydroxy-phenyl)-vinyl]-benzo[4,5]imidazo[1,2-a]quinolin-1-ylmethyl}-isoindole-1,3-dione | CHEMBL389311
TypeSmall organic molecule
Emp. Form.C32H21N3O4
Mol. Mass.511.5268
SMILESOc1ccc(\C=C\c2cc3nc4ccccc4n3c3c(CN4C(=O)c5ccccc5C4=O)c(O)ccc23)cc1