Reaction Details
TargetCholecystokinin receptor type A
LigandBDBM50208420
Substrate/Competitorn/a
Meas. Tech.ChEMBL_443246 (CHEMBL893496)
IC50 942±n/a nM
Citation Tiwari, AKMishra, AKBajpai, AMishra, PSingh, SSinha, DSingh, VK Synthesis and evaluation of novel benzimidazole derivative [Bz-Im] and its radio/biological studies. Bioorg Med Chem Lett17:2749-55 (2007) 
 
Cholecystokinin receptor type A
Name:Cholecystokinin receptor type A
Type:Enzyme Catalytic Domain
Mol. Mass.:49676.37
Organism:RAT
Description:Cholecystokinin central 0 RAT::P30551
Residue:444
BDBM50208420
NameBDBM50208420
Synonyms:2-[2-hydroxy-5-((E)-styryl)-benzo[4,5]imidazo[1,2-a]quinolin-1-ylmethyl]-isoindole-1,3-dione | CHEMBL233647
TypeSmall organic molecule
Emp. Form.C32H21N3O3
Mol. Mass.495.5274
SMILESOc1ccc2c(\C=C\c3ccccc3)cc3nc4ccccc4n3c2c1CN1C(=O)c2ccccc2C1=O