Reaction Details
TargetHistamine H3 receptor
LigandBDBM50209809
Substrate/Competitorn/a
Meas. Tech.ChEMBL_455315 (CHEMBL886091)
Ki 0.2±n/a nM
Citation Stocking, EMMiller, JMBarbier, AJWilson, SJBoggs, JDMcAllister, HMWu, JLovenberg, TWCarruthers, NIWolin, RL Synthesis and biological evaluation of diamine-based histamine H3 antagonists with serotonin reuptake inhibitor activity. Bioorg Med Chem Lett17:3130-5 (2007) 
 
Histamine H3 receptor
Name:Histamine H3 receptor
Type:G Protein-Coupled Receptor (GPCR)
Mol. Mass.:48691.47
Organism:Homo sapiens (Human)
Description:Binding assays were using CHO cells stably expressing hH3R receptors.
Residue:445
BDBM50209809
NameBDBM50209809
Synonyms:4-(3-(dimethylamino)-1-(4-(3-(piperidin-1-yl)propoxy)phenyl)propoxy)benzonitrile | CHEMBL246126
TypeSmall organic molecule
Emp. Form.C26H35N3O2
Mol. Mass.421.575
SMILESCN(C)CCC(Oc1ccc(cc1)C#N)c1ccc(OCCCN2CCCCC2)cc1