Reaction Details
TargetHistamine H3 receptor
LigandBDBM50209806
Substrate/Competitorn/a
Meas. Tech.ChEMBL_455315 (CHEMBL886091)
Ki 0.7±n/a nM
Citation Stocking, EMMiller, JMBarbier, AJWilson, SJBoggs, JDMcAllister, HMWu, JLovenberg, TWCarruthers, NIWolin, RL Synthesis and biological evaluation of diamine-based histamine H3 antagonists with serotonin reuptake inhibitor activity. Bioorg Med Chem Lett17:3130-5 (2007) 
 
Histamine H3 receptor
Name:Histamine H3 receptor
Type:G Protein-Coupled Receptor (GPCR)
Mol. Mass.:48691.47
Organism:Homo sapiens (Human)
Description:Binding assays were using CHO cells stably expressing hH3R receptors.
Residue:445
BDBM50209806
NameBDBM50209806
Synonyms:CHEMBL245307 | N,N-dimethyl-3-phenyl-3-(3-(3-(piperidin-1-yl)propoxy)phenoxy)propan-1-amine
TypeSmall organic molecule
Emp. Form.C25H36N2O2
Mol. Mass.396.5655
SMILESCN(C)CCC(Oc1cccc(OCCCN2CCCCC2)c1)c1ccccc1