Reaction Details
Target5-hydroxytryptamine receptor 2B
LigandBDBM50210081
Substrate/Competitorn/a
Meas. Tech.ChEMBL_443938 (CHEMBL893104)
EC50 6.2±n/a nM
Citation Feng, ZMohapatra, SKlimko, PGHellberg, MRMay, JAKelly, CWilliams, GMcLaughlin, MASharif, NA Novel benzodifuran analogs as potent 5-HT2A receptor agonists with ocular hypotensive activity. Bioorg Med Chem Lett17:2998-3002 (2007) 
 
5-hydroxytryptamine receptor 2B
Name:5-hydroxytryptamine receptor 2B
Type:Enzyme Catalytic Domain
Mol. Mass.:53668.47
Organism:RAT
Description:5-HT2B HTR2B RAT::P30994
Residue:479
BDBM50210081
NameBDBM50210081
Synonyms:(1R,2R)-2-amino-1-(8-bromo-2,3,6,7-tetrahydro-benzo[1,2-b;4,5-b']difuran-4-yl)-propan-1-ol | CHEMBL391196
TypeSmall organic molecule
Emp. Form.C13H16BrNO3
Mol. Mass.314.175
SMILESC[C@@H](N)[C@H](O)c1c2CCOc2c(Br)c2CCOc12