Reaction Details
Target5-hydroxytryptamine receptor 2B
LigandBDBM50210083
Substrate/Competitorn/a
Meas. Tech.ChEMBL_443938 (CHEMBL893104)
EC50 59±n/a nM
Citation Feng, ZMohapatra, SKlimko, PGHellberg, MRMay, JAKelly, CWilliams, GMcLaughlin, MASharif, NA Novel benzodifuran analogs as potent 5-HT2A receptor agonists with ocular hypotensive activity. Bioorg Med Chem Lett17:2998-3002 (2007) 
 
5-hydroxytryptamine receptor 2B
Name:5-hydroxytryptamine receptor 2B
Type:Enzyme Catalytic Domain
Mol. Mass.:53668.47
Organism:RAT
Description:5-HT2B HTR2B RAT::P30994
Residue:479
BDBM50210083
NameBDBM50210083
Synonyms:CHEMBL232995 | [8-((R)-2-amino-propyl)-2,3,6,7-tetrahydro-benzo[1,2-b;4,5-b']difuran-4-ylmethoxy]-acetic acid phenyl ester
TypeSmall organic molecule
Emp. Form.C22H25NO5
Mol. Mass.383.4376
SMILESC[C@@H](N)Cc1c2CCOc2c(COCC(=O)Oc2ccccc2)c2CCOc12