Reaction Details
Target5-hydroxytryptamine receptor 2A
LigandBDBM50210084
Substrate/Competitorn/a
Meas. Tech.ChEMBL_443937 (CHEMBL893103)
EC50 16.9±n/a nM
Citation Feng, ZMohapatra, SKlimko, PGHellberg, MRMay, JAKelly, CWilliams, GMcLaughlin, MASharif, NA Novel benzodifuran analogs as potent 5-HT2A receptor agonists with ocular hypotensive activity. Bioorg Med Chem Lett17:2998-3002 (2007) 
 
5-hydroxytryptamine receptor 2A
Name:5-hydroxytryptamine receptor 2A
Type:G Protein-Coupled Receptor (GPCR)
Mol. Mass.:52852.05
Organism:Rattus norvegicus (rat)
Description:Rat cortex membranes 5-HT2A receptors.
Residue:471
BDBM50210084
NameBDBM50210084
Synonyms:(R)-1-methyl-2-[8-(3-methyl-[1,2,4]oxadiazol-5-ylmethyl)-benzo[1,2-b;4,5-b']difuran-4-yl]-ethylamine | CHEMBL234682
TypeSmall organic molecule
Emp. Form.C17H17N3O3
Mol. Mass.311.3352
SMILESC[C@@H](N)Cc1c2ccoc2c(Cc2nc(C)no2)c2ccoc12