Reaction Details
Target5-hydroxytryptamine receptor 2C
LigandBDBM50210078
Substrate/Competitorn/a
Meas. Tech.ChEMBL_443939 (CHEMBL893105)
EC50 12.6±n/a nM
Citation Feng, ZMohapatra, SKlimko, PGHellberg, MRMay, JAKelly, CWilliams, GMcLaughlin, MASharif, NA Novel benzodifuran analogs as potent 5-HT2A receptor agonists with ocular hypotensive activity. Bioorg Med Chem Lett17:2998-3002 (2007) 
 
5-hydroxytryptamine receptor 2C
Name:5-hydroxytryptamine receptor 2C
Type:Enzyme
Mol. Mass.:51935.10
Organism:Rattus norvegicus (Rat)
Description:P08909
Residue:460
BDBM50210078
NameBDBM50210078
Synonyms:(R)-2-(8-methoxymethyl-2,3,6,7-tetrahydro-benzo[1,2-b;4,5-b']difuran-4-yl)-1-methyl-ethylamine | CHEMBL234464
TypeSmall organic molecule
Emp. Form.C15H21NO3
Mol. Mass.263.3321
SMILESCOCc1c2CCOc2c(C[C@@H](C)N)c2CCOc12