Reaction Details
Target5-hydroxytryptamine receptor 2C
LigandBDBM50210083
Substrate/Competitorn/a
Meas. Tech.ChEMBL_443939 (CHEMBL893105)
EC50 4.5±n/a nM
Citation Feng, ZMohapatra, SKlimko, PGHellberg, MRMay, JAKelly, CWilliams, GMcLaughlin, MASharif, NA Novel benzodifuran analogs as potent 5-HT2A receptor agonists with ocular hypotensive activity. Bioorg Med Chem Lett17:2998-3002 (2007) 
 
5-hydroxytryptamine receptor 2C
Name:5-hydroxytryptamine receptor 2C
Type:Enzyme
Mol. Mass.:51935.10
Organism:Rattus norvegicus (Rat)
Description:P08909
Residue:460
BDBM50210083
NameBDBM50210083
Synonyms:CHEMBL232995 | [8-((R)-2-amino-propyl)-2,3,6,7-tetrahydro-benzo[1,2-b;4,5-b']difuran-4-ylmethoxy]-acetic acid phenyl ester
TypeSmall organic molecule
Emp. Form.C22H25NO5
Mol. Mass.383.4376
SMILESC[C@@H](N)Cc1c2CCOc2c(COCC(=O)Oc2ccccc2)c2CCOc12