Reaction Details
TargetCoagulation factor X
LigandBDBM50206984
Substrate/Competitorn/a
Meas. Tech.ChEMBL_455363 (CHEMBL886138)
Ki 2±n/a nM
Citation Young, RJBrown, DBurns-Kurtis, CLChan, CConvery, MAHubbard, JAKelly, HAPateman, AJPatikis, ASenger, SShah, GPToomey, JRWatson, NSZhou, P Selective and dual action orally active inhibitors of thrombin and factor Xa. Bioorg Med Chem Lett17:2927-30 (2007) 
 
Coagulation factor X
Name:Coagulation factor X
Type:Enzyme
Mol. Mass.:54726.60
Organism:Homo sapiens (Human)
Description:n/a
Residue:488
BDBM50206984
NameBDBM50206984
Synonyms:(2R)-2-(5-CHLORO-2-THIENYL)-N-{(3S)-1-[(1S)-1-METHYL-2-MORPHOLIN-4-YL-2-OXOETHYL]-2-OXOPYRROLIDIN-3-YL}PROPENE-1-SULFONAMIDE 2-(5-chlorothiophen-2-yl)-N-((S)-1-((S)-1-morpholino-1-oxopropan-2-yl)-2-oxopyrrolidin-3-yl)prop-1-ene-1-sulfonamide | CHEMBL391640
TypeSmall organic molecule
Emp. Form.C18H24ClN3O5S2
Mol. Mass.461.983
SMILESC[C@H](N1CC[C@H](NS(=O)(=O)\C=C(/C)c2ccc(Cl)s2)C1=O)C(=O)N1CCOCC1