Reaction Details
TargetNociceptin receptor
LigandBDBM50210213
Substrate/Competitorn/a
Meas. Tech.ChEMBL_443964 (CHEMBL892111)
Ki 27±n/a nM
Citation Ho, GDBercovici, ATulshian, DGreenlee, WJFawzi, AFernandez, XMcLeod, RLSmith Torhan, AZhang, H Synthesis and structure-activity relationships of 4-hydroxy-4-phenylpiperidines as nociceptin receptor ligands: Part 2. Bioorg Med Chem Lett17:3028-33 (2007) 
 
Nociceptin receptor
Name:Nociceptin receptor
Type:G Protein-Coupled Receptor (GPCR)
Mol. Mass.:40702.87
Organism:Homo sapiens (Human)
Description:P41146
Residue:370
BDBM50210213
NameBDBM50210213
Synonyms:1-benzhydryl-4-m-tolylpiperidin-4-ol | CHEMBL437380
TypeSmall organic molecule
Emp. Form.C25H27NO
Mol. Mass.357.488
SMILESCc1cccc(c1)C1(O)CCN(CC1)C(c1ccccc1)c1ccccc1