Reaction Details
TargetNociceptin receptor
LigandBDBM50210217
Substrate/Competitorn/a
Meas. Tech.ChEMBL_443964 (CHEMBL892111)
Ki 5.5±n/a nM
Citation Ho, GDBercovici, ATulshian, DGreenlee, WJFawzi, AFernandez, XMcLeod, RLSmith Torhan, AZhang, H Synthesis and structure-activity relationships of 4-hydroxy-4-phenylpiperidines as nociceptin receptor ligands: Part 2. Bioorg Med Chem Lett17:3028-33 (2007) 
 
Nociceptin receptor
Name:Nociceptin receptor
Type:G Protein-Coupled Receptor (GPCR)
Mol. Mass.:40702.87
Organism:Homo sapiens (Human)
Description:P41146
Residue:370
BDBM50210217
NameBDBM50210217
Synonyms:4-(2-(aminomethyl)phenyl)-1-(4,4-dimethyl-1,2,3,4-tetrahydronaphthalen-1-yl)piperidin-4-ol | CHEMBL233957
TypeSmall organic molecule
Emp. Form.C24H32N2O
Mol. Mass.364.5237
SMILESCC1(C)CCC(N2CCC(O)(CC2)c2ccccc2CN)c2ccccc12