Reaction Details
TargetNociceptin receptor
LigandBDBM50210227
Substrate/Competitorn/a
Meas. Tech.ChEMBL_443964 (CHEMBL892111)
Ki 16±n/a nM
Citation Ho, GDBercovici, ATulshian, DGreenlee, WJFawzi, AFernandez, XMcLeod, RLSmith Torhan, AZhang, H Synthesis and structure-activity relationships of 4-hydroxy-4-phenylpiperidines as nociceptin receptor ligands: Part 2. Bioorg Med Chem Lett17:3028-33 (2007) 
 
Nociceptin receptor
Name:Nociceptin receptor
Type:G Protein-Coupled Receptor (GPCR)
Mol. Mass.:40702.87
Organism:Homo sapiens (Human)
Description:P41146
Residue:370
BDBM50210227
NameBDBM50210227
Synonyms:1-benzhydryl-4-(2-(hydroxymethyl)phenyl)piperidin-4-ol | CHEMBL233502
TypeSmall organic molecule
Emp. Form.C25H27NO2
Mol. Mass.373.4874
SMILESOCc1ccccc1C1(O)CCN(CC1)C(c1ccccc1)c1ccccc1