Reaction Details
TargetMu-type opioid receptor
LigandBDBM50210211
Substrate/Competitorn/a
Meas. Tech.ChEMBL_443967 (CHEMBL892114)
Ki 72±n/a nM
Citation Ho, GDBercovici, ATulshian, DGreenlee, WJFawzi, AFernandez, XMcLeod, RLSmith Torhan, AZhang, H Synthesis and structure-activity relationships of 4-hydroxy-4-phenylpiperidines as nociceptin receptor ligands: Part 2. Bioorg Med Chem Lett17:3028-33 (2007) 
 
Mu-type opioid receptor
Name:Mu-type opioid receptor
Type:G Protein-Coupled Receptor (GPCR)
Mol. Mass.:44789.51
Organism:Homo sapiens (Human)
Description:P35372
Residue:400
BDBM50210211
NameBDBM50210211
Synonyms:4-(2-(aminomethyl)phenyl)-1-((2-bromophenyl)(phenyl)methyl)piperidin-4-ol | CHEMBL233536
TypeSmall organic molecule
Emp. Form.C25H27BrN2O
Mol. Mass.451.399
SMILESNCc1ccccc1C1(O)CCN(CC1)C(c1ccccc1)c1ccccc1Br