Reaction Details
TargetKappa-type opioid receptor
LigandBDBM50210247
Substrate/Competitorn/a
Meas. Tech.ChEMBL_443966 (CHEMBL892113)
Ki 30±n/a nM
Citation Ho, GDBercovici, ATulshian, DGreenlee, WJFawzi, AFernandez, XMcLeod, RLSmith Torhan, AZhang, H Synthesis and structure-activity relationships of 4-hydroxy-4-phenylpiperidines as nociceptin receptor ligands: Part 2. Bioorg Med Chem Lett17:3028-33 (2007) 
 
Kappa-type opioid receptor
Name:Kappa-type opioid receptor
Type:G Protein-Coupled Receptor (GPCR)
Mol. Mass.:42648.76
Organism:Homo sapiens (Human)
Description:P41145
Residue:380
BDBM50210247
NameBDBM50210247
Synonyms:4-(2-(aminomethyl)phenyl)-1-(1-phenylhexyl)piperidin-4-ol | CHEMBL441914
TypeSmall organic molecule
Emp. Form.C24H34N2O
Mol. Mass.366.5396
SMILESCCCCCC(N1CCC(O)(CC1)c1ccccc1CN)c1ccccc1