Reaction Details
TargetNociceptin receptor
LigandBDBM50210196
Substrate/Competitorn/a
Meas. Tech.ChEMBL_443964 (CHEMBL892111)
Ki 62±n/a nM
Citation Ho, GDBercovici, ATulshian, DGreenlee, WJFawzi, AFernandez, XMcLeod, RLSmith Torhan, AZhang, H Synthesis and structure-activity relationships of 4-hydroxy-4-phenylpiperidines as nociceptin receptor ligands: Part 2. Bioorg Med Chem Lett17:3028-33 (2007) 
 
Nociceptin receptor
Name:Nociceptin receptor
Type:G Protein-Coupled Receptor (GPCR)
Mol. Mass.:40702.87
Organism:Homo sapiens (Human)
Description:P41146
Residue:370
BDBM50210196
NameBDBM50210196
Synonyms:1-benzhydryl-4-tert-butylpiperidin-4-ol | CHEMBL234771
TypeSmall organic molecule
Emp. Form.C22H29NO
Mol. Mass.323.4718
SMILESCC(C)(C)C1(O)CCN(CC1)C(c1ccccc1)c1ccccc1