Reaction Details
TargetB1 bradykinin receptor
LigandBDBM50210363
Substrate/Competitorn/a
Meas. Tech.ChEMBL_443978 (CHEMBL893140)
Ki 3.7±n/a nM
Citation Su, DSLim, JLMarkowitz, MKWan, BLMurphy, KLReiss, DRHarrell, CMO'Malley, SSRansom, RWChang, RSPettibone, DJTang, CPrueksaritanont, TFreidinger, RMBock, MG Potent bradykinin B1 receptor antagonists: 4-substituted phenyl cyclohexanes. Bioorg Med Chem Lett17:3006-9 (2007) 
 
B1 bradykinin receptor
Name:B1 bradykinin receptor
Type:Enzyme
Mol. Mass.:40508.87
Organism:Homo sapiens (Human)
Description:P46663
Residue:353
BDBM50210363
NameBDBM50210363
Synonyms:CHEMBL233886 | N-(2-((4-(2-chlorophenyl)-4-cyanocyclohexyl)methylamino)pyridin-3-yl)-3,3,3-trifluoropropanamide
TypeSmall organic molecule
Emp. Form.C22H22ClF3N4O
Mol. Mass.450.884
SMILESFC(F)(F)CC(=O)Nc1cccnc1NCC1CCC(CC1)(C#N)c1ccccc1Cl