Reaction Details
TargetB1 bradykinin receptor
LigandBDBM50210371
Substrate/Competitorn/a
Meas. Tech.ChEMBL_443978 (CHEMBL893140)
Ki 3.7±n/a nM
Citation Su, DSLim, JLMarkowitz, MKWan, BLMurphy, KLReiss, DRHarrell, CMO'Malley, SSRansom, RWChang, RSPettibone, DJTang, CPrueksaritanont, TFreidinger, RMBock, MG Potent bradykinin B1 receptor antagonists: 4-substituted phenyl cyclohexanes. Bioorg Med Chem Lett17:3006-9 (2007) 
 
B1 bradykinin receptor
Name:B1 bradykinin receptor
Type:Enzyme
Mol. Mass.:40508.87
Organism:Homo sapiens (Human)
Description:P46663
Residue:353
BDBM50210371
NameBDBM50210371
Synonyms:CHEMBL388030 | N-(2-((4-cyano-4-(3-fluorophenyl)cyclohexyl)methylamino)pyridin-3-yl)-3,3,3-trifluoropropanamide
TypeSmall organic molecule
Emp. Form.C22H22F4N4O
Mol. Mass.434.4299
SMILESFc1cccc(c1)C1(CCC(CNc2ncccc2NC(=O)CC(F)(F)F)CC1)C#N